{"text_format":"1","workbook":"xlsx","n_sheets":3,"sheets":["Instructions","Address Collection Sheet","Lists"],"not_rendered":{"charts":0,"images":1,"macros":1,"external_links":0,"defined_names":15,"comments":1,"pivot_tables":0},"unopened":[],"bounds":{"document_bytes":16777216,"sheet_cells":100000,"rows_first":2000,"rows_last":500,"rows_between":2000,"halvings":0,"cell_chars":16384,"cell_head_chars":4096},"cells_cut":0,"cells_raw":0,"read":"whole","date_system":"1900"}

{"sheet":"Instructions","index":0,"n_rows":21,"n_cols":9,"rows_kept":21,"cut":false,"hidden":false,"merged":[[8,1,8,10],[10,1,10,10],[11,1,11,10],[15,9,15,10],[20,1,20,2],[20,5,20,6],[15,1,15,2],[15,5,15,6],[9,1,9,10]]}
["Completed files must be submitted to NRC Health no later than June 25, 2021."]
[]
[]
[]
[]
["You must Enable Macros to utilize this program."]
["If you experience a problem with utilizing macros, please email Teresa Costello at tmcostello@nrchealth.com to request a non-macro version. "]
[]
["●","Fill out your contact info, including email and phone number, in the highlighted spaces provided below."]
["●","Chose your facility name from the drop-down in the highlighted box below"]
[null,"To order surveys, please carefully provide the correct required information as this is your order and cannot be edited once it is submitted.  Do not submit a file more than once."]
["●","Employee surveys  – for all employees, full-time and part-time, use the address collection sheet on the second tab to enter information about each employee who will receive the web-based survey (first name, last name, and email address).  "]
[]
["Please provide contact info in the event our teams have questions regarding your data submission."]
[]
["Name:",null,null,null,"Email:",null,null,null,"Phone Number:"]
[]
["To order employee surveys, please enter the number needed in the yellow boxes below:"]
[]
[]
["Facility Name","ABBOTTS CREEK CENTER",null,null,"Corporation",{"$f":"IFERROR(VLOOKUP(FacilityName,Lists!A:B,2,FALSE),\"\")","v":"Genesis Health Care"}]

{"sheet":"Address Collection Sheet","index":1,"n_rows":4,"n_cols":6,"rows_kept":4,"cut":false,"hidden":false,"merged":[[0,4,0,5]]}
["Do Not Use","To order resident and family surveys, please enter information for each person who should receive a survey (one row per person)",null,null,"To order employee surveys, please enter information for each person who should receive a survey (one row per person)"]
["Facility ID","Facility Name","Corporation","First Name","Last Name","Email"]
[null,{"$f":"[0]!FacilityName","v":"ABBOTTS CREEK CENTER"},{"$f":"[0]!Corporation","v":"Genesis Health Care"},"Jane","Smith","jsmith@gmail.com"]
[null,{"$f":"[0]!FacilityName","v":"ABBOTTS CREEK CENTER"},{"$f":"[0]!Corporation","v":"Genesis Health Care"},"Tom","Jones","tjjones@nrchealth.com"]

{"sheet":"Lists","index":2,"n_rows":425,"n_cols":9,"rows_kept":425,"cut":false,"hidden":true,"merged":[]}
["Facilities","Corporations","Address","City","State","Zip","States","Survey Types","Languages"]
["ABBOTTS CREEK CENTER","Genesis Health Care","877 HILL EVERHART ROAD","LEXINGTON","NC",27295,"AL","Family","English"]
["ABERNETHY LAURELS","United Church Homes","102 LEONARD AVENUE","NEWTON","NC",28658,"AK",null,"Spanish"]
["ACCORDIUS HEALTH AND REHABILITATION","Accordius Health","38 CARTERS ROAD","GATESVILLE","NC",27938,"AZ"]
["ACCORDIUS HEALTH AT ABERDEEN","Accordius Health","915 PEE DEE ROAD","ABERDEEN","NC",28315,"AR"]
["ACCORDIUS HEALTH AT ASHEVILLE","Accordius Health","500 BEAVERDAM ROAD","ASHEVILLE","NC",28804,"CA"]
["ACCORDIUS HEALTH AT BREVARD","Accordius Health","115 N COUNTRY CLUB ROAD","BREVARD","NC",28712,"CO"]
["ACCORDIUS HEALTH AT CHARLOTTE","Accordius Health","5939 REDDMAN ROAD","CHARLOTTE","NC",28212,"CT"]
["ACCORDIUS HEALTH AT CLEMMONS","Accordius Health","3905 CLEMMONS ROAD","CLEMMONS","NC",27012,"DE"]
["ACCORDIUS HEALTH AT CONCORD","Accordius Health","515 LAKE CONCORD ROAD NE","CONCORD","NC",28025,"FL"]
["ACCORDIUS HEALTH AT CREEKSIDE CARE","Accordius Health","604 STOKES STREET EAST","AHOSKIE","NC",27910,"GA"]
["ACCORDIUS HEALTH AT GASTONIA","Accordius Health","416 N HIGHLAND STREET","GASTONIA","NC",28052,"HI"]
["ACCORDIUS HEALTH AT GREENSBORO, LLC","Accordius Health","1201 CAROLINA STREET","GREENSBORO","NC",27401,"ID"]
["ACCORDIUS HEALTH AT HENDERSONVILLE LLC","Accordius Health","200 HERITAGE CIRCLE","HENDERSONVILLE","NC",28791,"IL"]
["ACCORDIUS HEALTH AT LEXINGTON","Accordius Health","279 BRIAN CENTER DRIVE","LEXINGTON","NC",27292,"IN"]
["ACCORDIUS HEALTH AT MIDWOOD, LLC","Accordius Health","2727 SHAMROCK DRIVE","CHARLOTTE","NC",28205,"IA"]
["ACCORDIUS HEALTH AT MONROE","Accordius Health","204 OLD HIGHWAY 74 EAST","MONROE","NC",28112,"KS"]
["ACCORDIUS HEALTH AT MOORESVILLE","Accordius Health","752 E CENTER AVENUE","MOORESVILLE","NC",28115,"KY"]
["ACCORDIUS HEALTH AT ROSE MANOR LLC","Accordius Health","4230 NORTH ROXBORO STREET","DURHAM","NC",27704,"LA"]
["ACCORDIUS HEALTH AT RUTHERFORD LLC","Accordius Health","188 OSCAR JUSTICE ROAD","RUTHERFORDTON","NC",28139,"ME"]
["ACCORDIUS HEALTH AT SALISBURY","Accordius Health","635 STATESVILLE BOULEVARD","SALISBURY","NC",28144,"MD"]
["ACCORDIUS HEALTH AT SCOTLAND MANOR","Accordius Health","920 JR HIGH SCHOOL ROAD","SCOTLAND NECK","NC",27874,"MA"]
["ACCORDIUS HEALTH AT STATESVILLE","Accordius Health","520 VALLEY STREET","STATESVILLE","NC",28677,"MI"]
["ACCORDIUS HEALTH AT WILKESBORO","Accordius Health","1000 COLLEGE STREET","WILKESBORO","NC",28697,"MN"]
["ACCORDIUS HEALTH AT WILMINGTON","Accordius Health","820 WELLINGTON AVENUE","WILMINGTON","NC",28401,"MS"]
["ACCORDIUS HEALTH AT WILSON","Accordius Health","1804 FOREST HILLS ROAD W","WILSON","NC",27893,"MO"]
["ACCORDIUS HEALTH AT WINSTON SALEM","Accordius Health","4911 BRIAN CENTER LANE","WINSTON-SALEM","NC",27106,"MT"]
["ADAMS FARM LIVING & REHABILITATION","Centruy Care Management","5100 MACKAY ROAD","JAMESTOWN","NC",27282,"NE"]
["ALAMANCE HEALTH CARE CENTER","Medical Facilities of America","1987 HILTON STREET","BURLINGTON","NC",27217,"NV"]
["ALEXANDRIA PLACE","WOS Inc.","1770 OAK HOLLOW ROAD","GASTONIA","NC",28054,"NH"]
["ALLEGHANY CENTER","Genesis Health Care","179 COMBS STREET","SPARTA","NC",28675,"NJ"]
["ALPINE HEALTH AND REHABILITATION OF ASHEBORO","Alpine Health and Rehab","230 EAST PRESNELL STREET","ASHEBORO","NC",27203,"NM"]
["ALSTON BROOK","Golden Age of Lexington, Inc.","4748 OLD SALISBURY ROAD","LEXINGTON","NC",27295,"NY"]
["ANSON HEALTH AND REHABILITATION","Sanstone Health ","405 SOUTH GREENE STREET","WADESBORO","NC",28170,"NC"]
["ARBOR ACRES UNITED METHODIST RETIREMENT COMMUNITY","ARBOR ACRES ","1250 ARBOR ROAD","WINSTON SALEM","NC",27104,"ND"]
["ASBURY HEALTH AND REHABILITATION CENTER","Aldersgate, United Meth. Ret.","3211 BISHOPS WAY LANE","CHARLOTTE","NC",28215,"OH"]
["ASHTON HEALTH AND REHABILITATION","Sanstone Health ","5533 BURLINGTON ROAD","MCLEANSVILLE","NC",27301,"OK"]
["ASTON PARK HEALTH CARE CENTER","Aston Park Health Care Center","380 BREVARD ROAD","ASHEVILLE","NC",28806,"OR"]
["AUTUMN CARE OF BISCOE","Saber Healthcare","401 LAMBERT ROAD","BISCOE","NC",27209,"PA"]
["AUTUMN CARE OF CORNELIUS","Saber Healthcare","19530 MOUNT ZION PARKWAY","CORNELIUS","NC",28031,"RI"]
["AUTUMN CARE OF DREXEL","Saber Healthcare","307 OAKLAND AVENUE","MORGANTON","NC",28655,"SC"]
["AUTUMN CARE OF FAYETTEVILLE","Saber Healthcare","1401 71ST SCHOOL ROAD","FAYETTEVILLE","NC",28314,"SD"]
["AUTUMN CARE OF MARION","Saber Healthcare","1264 AIRPORT ROAD","MARION","NC",28752,"TN"]
["AUTUMN CARE OF MARSHVILLE","Saber Healthcare","311 W PHIFER STREET","MARSHVILLE","NC",28103,"TX"]
["AUTUMN CARE OF MYRTLE GROVE","Saber Healthcare","5725 CAROLINA BEACH ROAD","WILMINGTON","NC",28412,"UT"]
["AUTUMN CARE OF NASH","Saber Healthcare","1210 EASTERN AVENUE","NASHVILLE","NC",27856,"VT"]
["AUTUMN CARE OF RAEFORD","Saber Healthcare","1206 N FULTON STREET","RAEFORD","NC",28376,"VA"]
["AUTUMN CARE OF SALISBURY","Saber Healthcare","1505 BRINGLE FERRY ROAD","SALISBURY","NC",28146,"WA"]
["AUTUMN CARE OF SALUDA","Saber Healthcare","501 ESSEOLA CIRCLE","SALUDA","NC",28773,"WV"]
["AUTUMN CARE OF SHALLOTTE","Saber Healthcare","237 MULBERRY STREET","SHALLOTTE","NC",28459,"WI"]
["AUTUMN CARE OF STATESVILLE","Saber Healthcare","2001 VANHAVEN DRIVE","STATESVILLE","NC",28625,"WY"]
["AUTUMN CARE OF WAYNESVILLE","Saber Healthcare","360 OLD BALSAM ROAD","WAYNESVILLE","NC",28786]
["AYDEN COURT NURSING AND REHABILITATION CENTER","Principle LTC","128 SNOW HILL ROAD","AYDEN","NC",28513]
["AZALEA HEALTH & REHAB CENTER","Saber Healthcare","3800 INDEPENDENCE BOULEVARD","WILMINGTON","NC",28412]
["BARBOUR COURT NURSING AND REHABILITATION CENTER","Principle LTC","515 BARBOUR ROAD","SMITHFIELD","NC",27577]
["BAYVIEW NURSING & REHAB CENTER","Centruy Care Management","3003 KENSINGTON PARK DRIVE","NEW BERN","NC",28560]
["BELAIRE HEALTH CARE CENTER","Medical Facilities of America","2065 LYON STREET","GASTONIA","NC",28052]
["BELLAROSE NURSING AND REHAB","BELLAROSE NURSING AND REHAB","200 BELLAROSE LAKE WAY","GARNER","NC",27529]
["BERMUDA COMMONS NURSING AND REHABILITATION CENTER","LIBERTY HEALTHCARE","316 NC HIGHWAY 801 SOUTH","ADVANCE","NC",27006]
["BERMUDA VILLAGE RETIREMENT CENTER","Progressive Management Group, LLC","142 BERMUDA VILLAGE DRIVE","BERMUDA RUN","NC",27006]
["BETHANY WOODS NURSING AND REHABILITATION CENTER","Principle LTC","33426 OLD SALISBURY ROAD BOX 1250","ALBEMARLE","NC",28002]
["BETHESDA HEALTH CARE FACILITY","JacTom Inc. - Tom Gatewood","3532 DUNN ROAD","EASTOVER","NC",28301]
["BIG ELM RETIREMENT AND NURSING CENTERS","Senior Ventures & Mgmt., Inc.","1285 WEST A STREET","KANNAPOLIS","NC",28081]
["BLADEN EAST HEALTH AND REHAB, LLC","BLADEN EAST HEALTH AND REHAB, LLC","804 S POPLAR STREET","ELIZABETHTOWN","NC",28337]
["BLUE RIDGE HEALTH AND REHABILITATION CENTER","Sava Senior Care","1510 HEBRON STREET","HENDERSONVILLE","NC",28739]
["BLUMENTHAL NURSING & REHABILITATION CENTER","Universal Healthcare, Inc.","3724 WIRELESS DRIVE","GREENSBORO","NC",27455]
["BRADLEY CREEK HEALTH CENTER","LIBERTY HEALTHCARE","740 DIAMOND SHOALS ROAD","WILMINGTON","NC",28403]
["BRANTWOOD NH & RETIREMENT CENT","Granville County","1038 COLLEGE STREET","OXFORD","NC",27565]
["BRIAN CENTER CABARRUS","Sava Senior Care","250 BISHOP LANE","CONCORD","NC",28025]
["BRIAN CENTER CLAYTON","Sava Senior Care","204 DAIRY ROAD","CLAYTON","NC",27520]
["BRIAN CENTER EDEN","Sava Senior Care","226 N OAKLAND AVENUE","EDEN","NC",27288]
["BRIAN CENTER GASTONIA","Sava Senior Care","969 COX ROAD","GASTONIA","NC",28054]
["BRIAN CENTER GOLDSBORO","Sava Senior Care","1700 WAYNE MEMORIAL DRIVE","GOLDSBORO","NC",27534]
["BRIAN CENTER HENDERSONVILLE","Sava Senior Care","1870 PISGAH DRIVE","HENDERSONVILLE","NC",28791]
["BRIAN CENTER HERTFORD","Sava Senior Care","1300 DON JUAN ROAD","HERTFORD","NC",27944]
["BRIAN CENTER HICKORY","Sava Senior Care","3031 TATE BOULEVARD SE","HICKORY","NC",28602]
["BRIAN CENTER HICKORY VIEWMONT","Sava Senior Care","220 13TH AVENUE PLACE NW","HICKORY","NC",28601]
["BRIAN CENTER LINCOLNTON","Sava Senior Care","515 S GENERALS BOULEVARD","LINCOLNTON","NC",28093]
["BRIAN CENTER SOUTHPOINT","Sava Senior Care","6000 FAYETTEVILLE ROAD","DURHAM","NC",27713]
["BRIAN CENTER SPRUCE PINES","Sava Senior Care","218 LAUREL CREEK COURT","SPRUCE PINE","NC",28777]
["BRIAN CENTER WALLACE","Sava Senior Care","647 S RAILROAD STREET BOX 966","WALLACE","NC",28466]
["BRIAN CENTER WEAVERVILLE","Sava Senior Care","78 WEAVER BOULEVARD","WEAVERVILLE","NC",28787]
["BRIAN CENTER WILSON","Sava Senior Care","2501 DOWNING STREET SW","WILSON","NC",27895]
["BRIAN CENTER WINDSOR","Sava Senior Care","1306 SOUTH KING STREET","WINDSOR","NC",27983]
["BRIAN CENTER YANCEYVILLE","Sava Senior Care","1086 MAIN STREET NORTH","YANCEYVILLE","NC",27379]
["BRIGHTMOOR NURSING CENTER","Linda Howard","610 WEST FISHER STREET","SALISBURY","NC",28145]
["BROOK STONE LIVING CENTER","BROOK STONE LIVING CENTER","8990 HIGHWAY 17 SOUTH","POLLOCKSVILLE","NC",28573]
["BROOKDALE CARRIAGE CLUB PROVIDENCE","Brookdale Senior Living","5804 OLD PROVIDENCE ROAD","CHARLOTTE","NC",28226]
["BROOKRIDGE RETIREMENT COMMUNITY","Baptist Retirement Homes","1199 HAYES FOREST DRIVE","WINSTON-SALEM","NC",27106]
["BRUNSWICK COVE NURSING CENTER","BRUNSWICK COVE NURSING CENTER","1478 RIVER ROAD","WINNABOW","NC",28479]
["BRUNSWICK HEALTH & REHAB CENTER","Saber Healthcare","9600 NO 5 SCHOOL ROAD","ASH","NC",28420]
["BRYAN HEALTH AND REHAB","Our Community Hospital Inc","921 JUNIOR HIGH SCHOOL ROAD","SCOTLAND NECK","NC",27874]
["CAMDEN HEALTH AND REHABILITATION","Sanstone Health","1 MARITHE COURT","GREENSBORO","NC",27407]
["CAPITAL NURSING AND REHABILITATION CENTER","LIBERTY HEALTHCARE","3000 HOLSTON LANE","RALEIGH","NC",27610]
["CARDINAL HEALTHCARE AND REHAB","Consulate Health Care","931 N ASPEN STREET","LINCOLNTON","NC",28092]
["CAROL WOODS","CAROL WOODS","750 WEAVER DAIRY ROAD","CHAPEL HILL","NC",27514]
["CAROLINA CARE HEALTH AND REHABILITATION","Sanstone Health","111 HARRILSON STREET","CHERRYVILLE","NC",28021]
["CAROLINA PINES AT ASHEVILLE","Accordius Health","91 VICTORIA ROAD","ASHEVILLE","NC",28801]
["CAROLINA PINES AT GREENSBORO, LLC","Accordius Health","109 S HOLDEN RD","GREENSBORO","NC",27407]
["CAROLINA REHAB CENTER OF BURKE","Medical Facilities of America","3647 MILLER BRIDGE ROAD","CONNELLY SPG","NC",28612]
["CAROLINA REHAB CENTER OF CUMBERLAND","Medical Facilities of America","4600 CUMBERLAND ROAD","FAYETTEVILLE","NC",28306]
["CAROLINA RIVERS NURSING AND REHABILITATION CENTER","Principle LTC","1839 ONSLOW DRIVE EXTENSION","JACKSONVILLE","NC",28540]
["CAROLINA VILLAGE INC","CAROLINA VILLAGE INC","600 CAROLINA VILLAGE ROAD SUITE Z","HENDERSONVILLE","NC",28792]
["CARRINGTON PLACE","CARRINGTON PLACE","600 FULLWOOD LANE","MATTHEWS","NC",28105]
["Carrolton of Dunn","Carrolton Facility Management","711 SUSAN TART ROAD","DUNN","NC",28335]
["Carrolton of Fayetteville","Carrolton Facility Management","2461 LEGION ROAD","FAYETTEVILLE","NC",28306]
["Carrolton of Lumberton","Carrolton Facility Management","1170 LINKHAW ROAD","LUMBERTON","NC",28358]
["Carrolton of Nash","Carrolton Facility Management","7369 HUNTER HILL ROAD","ROCKY MOUNT","NC",27804]
["Carrolton of Plymouth","Carrolton Facility Management","1084 US 64 EAST","PLYMOUTH","NC",27962]
["Carrolton of Williamston","Carrolton Facility Management","119 GATLING STREET","WILLIAMSTON","NC",27892]
["CARVER LIVING CENTER","CCH Healthcare, LLC","303 EAST CARVER STREET","DURHAM","NC",27704]
["CARY HEALTH AND REHABILITATION","Consulate Health Care","6590 TRYON ROAD","CARY","NC",27518]
["CENTRAL CONTINUING CARE","CENTRAL CONTINUING CARE","1287 NEWSOME STREET","MOUNT AIRY","NC",27030]
["CHARLOTTE HEALTH & REHABILITATION CENTER","Medical Facilities of America","1735 TODDVILLE ROAD","CHARLOTTE","NC",28214]
["CHATHAM NURSING & REHABILITATION","Centruy Care Management","700 JOHNSTON RIDGE ROAD","ELKIN","NC",28621]
["CHERRY POINT BAY NURSING AND REHABILITATION CENTER","Principle LTC","110 MCCOTTER BOULEVARD","HAVELOCK","NC",28532]
["CHOWAN RIVER NURSING AND REHABILITATION CENTER","Principle LTC","1341 PARADISE ROAD P O BOX 566","EDENTON","NC",27932]
["CLAPP'S CONVALESCENT NURSING HOME INC","CLAPPS NURSING CENTER INC","500 MOUNTAIN TOP DRIVE","ASHEBORO","NC",27203]
["CLAPPS NURSING CENTER INC","CLAPPS NURSING CENTER INC","5229 APPOMATTOX ROAD","PLEASANT GARDEN","NC",27313]
["CLAY COUNTY CARE CENTER","Consulate Health Care","86 VALLEY HIDEAWAY DRIVE","HAYESVILLE","NC",28904]
["CLEAR CREEK NURSING & REHABILITATION CENTER","Principle LTC","10506 CLEAR CREEK COMMERCE DRIVE","MINT HILL","NC",28227]
["CLEVELAND PINES","Atrium Health","1404 N LAFAYETTE STREET","SHELBY","NC",28150]
["COLLEGE PINES HEALTH AND REHABILITATION","Sanstone Health ","95 LOCUST STREET","CONNELLY SPG","NC",28612]
["COMPASS HEALTHCARE AND REHAB HAWFIELDS, INC","Compas Healthcare","2502 S NC 119","MEBANE","NC",27302]
["COMPASS HEALTHCARE AND REHAB ROWAN, LLC","Compass Healthcare & Rehab","1404 S SALISBURY AVENUE","SPENCER","NC",28159]
["CONOVER NURSING AND REHAB CTR","Compass Healthcare & Rehab","920 4TH STREET SOUTHWEST","CONOVER","NC",28613]
["COUNTRYSIDE","Compass Healthcare & Rehab","7700 US 158 EAST","STOKESDALE","NC",27357]
["COURTLAND TERRACE","CaroMont Health","2300 ABERDEEN BOULEVARD","GASTONIA","NC",28054]
["CROASDAILE VILLAGE","United Methodist Retirement Homes, Inc.","2600 CROASDAILE FARM PARKWAY","DURHAM","NC",27705]
["CROATAN RIDGE NURSING AND REHABILITATION CENTER","Principle LTC","210 FOXHALL ROAD","NEWPORT","NC",28570]
["CROSS CREEK HEALTH CARE","LIBERTY HEALTHCARE","1719 QUARTER ROAD","SWANQUARTER","NC",27885]
["CRYSTAL BLUFFS REHABILITATION AND HEALTH CARE CENT","Centruy Care Management","4010 BRIDGES STREET EXTENSION","MOREHEAD CITY","NC",28557]
["CURRITUCK HEALTH & REHAB CENTER","Saber Healthcare","3907 CARATOKE HIGHWAY","BARCO","NC",27917]
["CYPRESS GLEN RETIREMENT COMMUNITY","United Methodist Retirement Homes","1000 HICKORY STREET","GREENVILLE","NC",27858]
["CYPRESS POINTE REHABILITATION CENTER","Southern HealthCare Management","2006 SOUTH 16TH STREET","WILMINGTON","NC",28401]
["DAVIE NURSING AND REHABILITATION CENTER","United Methodist Retirement Homes","498 MADISON ROAD","MOCKSVILLE","NC",27028]
["DAVIS HEALTH & WELLNESS CTR AT CAMBRIDGE VILLAG","Cornelia Nixon Davis Inc","83 CAVALIER DRIVE, STE 200","WILMINGTON","NC",28405]
["DAVIS HEALTH CARE CENTER","Cornelia Nixon Davis Inc","1011 PORTERS NECK ROAD","WILMINGTON","NC",28411]
["DEER PARK HEALTH & REHABILITATION","Senior Care Group","306 DEER PARK ROAD","NEBO","NC",28761]
["DEERFIELD EPISCOPAL  RETIREMENT","DEERFIELD EPISCOPAL  RETIREMENT","1617  HENDERSONVELLE ROAD","ASHEVILLE","NC",28803]
["DURHAM NURSING & REHABILITATION CENTER","DURHAM NURSING & REHABILITATION CENTER","411 S LASALLE STREET","DURHAM","NC",27705]
["EAST CAROLINA REHAB AND WELLNESS","EAST CAROLINA REHAB AND WELLNESS","2575 W 5TH STREET","GREENVILLE","NC",27834]
["ECKERD LIVING CENTER","MH Eckerd Living Center","250 HOSPITAL DRIVE","HIGHLANDS","NC",28741]
["EDGECOMBE HEALTH AND REHAB CENTER","Sava Senior Care","1000 WESTERN BOULEVARD","TARBORO","NC",27886]
["EDGEWOOD PLACE AT THE VILLAGE AT BROOKWOOD","EDGEWOOD PLACE AT THE VILLAGE AT BROOKWOOD","1820 BROOKWOOD AVENUE","BURLINGTON","NC",27215]
["ELDERBERRY HEALTH CARE","Wilkinson Health Care Center","415 ELDERBERRY LANE","MARSHALL","NC",28753]
["ELIZABETH CITY HEALTH AND REHABILITATION","Sanstone Health","1075 US HIGHWAY 17 SOUTH","ELIZABETH CITY","NC",27909]
["ELIZABETHTOWN HEALTHCARE & REHAB CENTER","LIBERTY HEALTHCARE","208 MERCER MILL ROAD","ELIZABETHTOWN","NC",28337]
["EMERALD HEALTH & REHAB CENTER","Saber Healthcare","54 RED MULBERRY WAY","LILLINGTON","NC",27546]
["EMERALD RIDGE REHAB AND CARE CENTER","Consulate Healthcare","25 REYNOLDS MOUNTAIN BOULEVARD","ASHEVILLE","NC",28804]
["FAIR HAVEN HOME INC","Mack McKeithan","149 FAIR HAVEN DRIVE","BOSTIC","NC",28018]
["FAIR HAVEN OF FOREST CITY, LLC","Mack McKeithan","830 BETHANY CHURCH ROAD","FOREST CITY","NC",28043]
["FIVE OAKS MANOR","Epic Group, LLC","413 WINECOFF SCHOOL ROAD","CONCORD","NC",28027]
["FLESHERS FAIRVIEW HEALTH CARE","Cheryl Mitchell, Lisa Dee, Susie Cole","3016 CANE CREEK ROAD","FAIRVIEW","NC",28730]
["FORREST OAKES HEALTHCARE CENTER","Consulate Health Care","620 HEATHWOOD DRIVE","ALBEMARLE","NC",28001]
["FRANKLIN OAKS NURSING AND REHABILITATION CENTER","Principle LTC","1704 NC HIGHWAY 39 N","LOUISBURG","NC",27549]
["FRIENDS HOMES AT GUILFORD","FRIENDS HOMES AT GUILFORD","925 NEW GARDEN ROAD","GREENSBORO","NC",27410]
["FRIENDS HOMES WEST","FRIENDS HOMES WEST","6100 W FRIENDLY AVENUE","GREENSBORO","NC",27410]
["GATEWAY REHABILITATION AND HEALTHCARE","Consulate Health Care","2030 HARPER AVENUE NW","LENOIR","NC",28645]
["GIVENS HEALTH CENTER","Givens Estates, Inc.","600 BARRETT LANE","ASHEVILLE","NC",28803]
["GIVENS HIGHLAND FARMS","Givens Estates LLC","200 TABERNACLE ROAD","BLACK MOUNTAIN","NC",28711]
["GLENAIRE","GLENAIRE","4000 GLENAIRE CIRCLE","CARY","NC",27511]
["GLENBRIDGE HEALTH AND REHABILTATION CENTER","GLENBRIDGE HEALTH AND REHABILTATION CENTER","211 MILTON BROWN HEIRS ROAD","BOONE","NC",28607]
["GLENFLORA","Lutheran Services Carolinas","5701 FAYETTEVILLE ROAD","LUMBERTON","NC",28360]
["GOLDEN YEARS NURSING HOME","LIBERTY HEALTHCARE","7348 NORTH WEST STREET","FALCON","NC",28342]
["GRACE HEIGHTS HEALTH & REHABILITATION","Sanstone Health ","109 FOOTHILLS DRIVE","MORGANTON","NC",28655]
["GRAHAM HEALTHCARE AND REHABILITATION CENTER","Principle LTC","811 SNOWBIRD ROAD","ROBBINSVILLE","NC",28771]
["GRANTSBROOK NURSING AND REHABILITATION CENTER","Principle LTC","290 KEEL ROAD","GRANTSBORO","NC",28529]
["GREENDALE FOREST NURSING AND REHABILITATION CENTER","Principle LTC","1304 SE SECOND STREET","SNOW HILL","NC",28580]
["GREENHAVEN HEALTH AND REHABILITATION CENTER","Principle LTC","801 GREENHAVEN DRIVE","GREENSBORO","NC",27406]
["GUILFORD HEALTH CARE CENTER","Medical Facilities of America","2041 WILLOW ROAD","GREENSBORO","NC",27406]
["HARBORVIEW HEALTH CARE CENTER","HARBORVIEW HEALTH CARE CENTER","812 SHEPARD STREET","MOREHEAD CITY","NC",28557]
["HARMONY HALL NURSING AND REHABILITATION CENTER","Principle LTC","312 WARREN AVENUE","KINSTON","NC",28502]
["HARNETT WOODS NURSING AND REHABILITATION CENTER","Principle LTC","604 LUCAS ROAD","DUNN","NC",28334]
["HAYMOUNT REHABILITATION & NURSING CENTER, INC","Centruy Care Management","2346 BARRINGTON CIRCLE","FAYETTEVILLE","NC",28303]
["HAYWOOD NURSING AND REHABILITATION CENTER","Sava Senior Care","516 WALL STREET","WAYNESVILLE","NC",28786]
["HEARTLAND LIVING & REHAB AT THE MOSES H CONE MEM H","Centruy Care Management","1131 NORTH CHURCH STREET","GREENSBORO","NC",27401]
["HENDERSONVILLE HEALTH AND REHABILITATION","Sanstone Health ","104 COLLEGE DRIVE","FLAT ROCK","NC",28731]
["HICKORY FALLS HEALTH AND REHABILITATION","Sanstone Health ","100 SUNSET STREET","GRANITE FALLS","NC",28630]
["HIGHLAND HOUSE REHABILITATION AND HEALTHCARE","Wilkinson Health Care Center","1700 PAMALEE DRIVE","FAYETTEVILLE","NC",28301]
["HILLCREST CONVALESCENT CENTER","Hillcrest","1417 W PETTIGREW STREET","DURHAM","NC",27705]
["HILLCREST RALEIGH AT CRABTREE VALLEY","Hillcrest","3830 BLUE RIDGE ROAD","RALEIGH","NC",27612]
["HILLSIDE NURSING CENTER OF WAKE FOREST","HILLSIDE NURSING CENTER OF WAKE FOREST","968 EAST WAIT AVENUE","WAKE FOREST","NC",27588]
["HOMESTEAD HILLS","Senior Living Communities","2101 HOMESTEAD HILLS DRIVE","WINSTON SALEM","NC",27103]
["HUNTER WOODS NURSING AND REHAB","Consulate Healthcare","620 TOM HUNTER ROAD","CHARLOTTE","NC",28213]
["HUNTERSVILLE HEALTH & REHAB CENTER","Medical Facilities of America","13835 BOREN STREET","HUNTERSVILLE","NC",28078]
["HUNTERSVILLE OAKS","Atrium Health","12019 VERHOEFF DRIVE","HUNTERSVILLE","NC",28078]
["INN AT QUAIL HAVEN VILLAGE","LIBERTY HEALTHCARE","155 BLAKE BOULEVARD","PINEHURST","NC",28374]
["IREDELL MEMORIAL HOSPITAL INC","IREDELL MEMORIAL HOSPITAL INC","557 BROOKDALE DRIVE","STATESVILLE","NC",28677]
["JACOB'S CREEK NURSING AND REHABILITATION CENTER","Principle LTC","1721 BALD HILL LOOP","MADISON","NC",27025]
["JESSE HELMS NURSING CENTER","Atrium Health","1411 DOVE STREET","MONROE","NC",28111]
["KENANSVILLE HEALTH & REHABILITATION CENTER","Sava Senior Care","209 BEASLEY STREET","KENANSVILLE","NC",28349]
["KERR LAKE NURSING AND REHABILITATION CENTER","Principle LTC","1245 PARK AVENUE","HENDERSON","NC",27536]
["KINDRED HOSPITAL EAST GREENSBORO","Kindred Hospital East LLC","2401 SOUTH SIDE BOULEVARD","GREENSBORO","NC",27406]
["LAKE PARK NURSING AND REHABILITATION CENTER","Principle LTC","3315 FAITH CHURCH ROAD","INDIAN TRAIL","NC",28079]
["LENOIR HEALTHCARE CENTER","Universal Healthcare, Inc.","322 NUWAY CIRCLE","LENOIR","NC",28645]
["LEXINGTON HEALTH CARE CENTER","Medical Facilities of America","17 CORNELIA DRIVE","LEXINGTON","NC",27292]
["Liberty Commons / Watauga County","LIBERTY HEALTHCARE","621 CHESTNUT RIDGE PARKWAY","BLOWING ROCK","NC",28605]
["LIBERTY COMMONS ALAMANCE","LIBERTY HEALTHCARE","791 BOONE STATION DRIVE","BURLINGTON","NC",27215]
["LIBERTY COMMONS COLUMBUS CTY","LIBERTY HEALTHCARE","1402 PINCKNEY STREET","WHITEVILLE","NC",28472]
{"$rows_left_out":225}